Ir para conteúdo
  • Cadastre-se

[HELP] Tento compilar e dá erro na source


Posts Recomendados

Bom galera, eu ja tenho tudo configurado, meu servidor já está compilado, eu só queria compilar uma nova source com spoffing para testar a funcionalidade, mas estou tendo problemas na instalação.

 

Dei permissão aos arquivos build.sh e autogen.sh

Mesmo assim acontece o seguinte erro em uma parte da compilação.

 

 

The Forgotten Server build script - 
Using ccache
CCache binaries located in /usr/lib/ccache
 
Start building on 8 cores, using 9 processes
 
make  all-am
make[1]: Entering directory `/otserv3/trunk'
  CXX    actions.o
  CXX    beds.o
  CXX    allocator.o
  CXX    baseevents.o
  CXX    chat.o
  CXX    combat.o
  CXX    condition.o
  CXX    configmanager.o
  CXX    connection.o
In file included from /usr/include/boost/thread/condition_variable.hpp:16:0,
                 from /usr/include/boost/thread.hpp:14,
                 from otsystem.h:34,
                 from luascript.h:20,
                 from configmanager.h:20,
                 from otpch.h:40,
                 from beds.cpp:17:
/usr/include/boost/thread/pthread/condition_variable.hpp: In member function âvoid boost::condition_variable::wait(boost::unique_lock<boost::mutex>&)â:
/usr/include/boost/thread/pthread/condition_variable.hpp:51:62: error: âinternal_mutexâ was not declared in this scopeIn file included from /usr/include/boost/thread/condition_variable.hpp:16:0,
                 from /usr/include/boost/thread.hpp:14,
                 from otsystem.h:34,
                 from luascript.h:20,
                 from configmanager.h:20,
                 from otpch.h:40,
                 from actions.cpp:17:
/usr/include/boost/thread/pthread/condition_variable.hpp: In member function âvoid boost::condition_variable::wait(boost::unique_lock<boost::mutex>&)â:
/usr/include/boost/thread/pthread/condition_variable.hpp:51:62: error: âinternal_mutexâ was not declared in this scope
 
/usr/include/boost/thread/pthread/condition_variable.hpp: In member function âbool boost::condition_variable::timed_wait(boost::unique_lock<boost::mutex>&, const system_time&)â:
/usr/include/boost/thread/pthread/condition_variable.hpp:61:62: error: âinternal_mutexâ was not declared in this scope/usr/include/boost/thread/pthread/condition_variable.hpp: In member function âbool boost::condition_variable::timed_wait(boost::unique_lock<boost::mutex>&, const system_time&)â:
/usr/include/boost/thread/pthread/condition_variable.hpp:61:62: error: âinternal_mutexâ was not declared in this scope
 
/usr/include/boost/thread/pthread/condition_variable.hpp: In member function âvoid boost::condition_variable::notify_one()â:
/usr/include/boost/thread/pthread/condition_variable.hpp:76:66: error: âinternal_mutexâ was not declared in this scope/usr/include/boost/thread/pthread/condition_variable.hpp: In member function âvoid boost::condition_variable::notify_one()â:
/usr/include/boost/thread/pthread/condition_variable.hpp:76:66: error: âinternal_mutexâ was not declared in this scope
 
/usr/include/boost/thread/pthread/condition_variable.hpp: In member function âvoid boost::condition_variable::notify_all()â:
/usr/include/boost/thread/pthread/condition_variable.hpp:82:66: error: âinternal_mutexâ was not declared in this scope
/usr/include/boost/thread/pthread/condition_variable.hpp: In member function âvoid boost::condition_variable::notify_all()â:
/usr/include/boost/thread/pthread/condition_variable.hpp:82:66: error: âinternal_mutexâ was not declared in this scope
In file included from /usr/include/boost/thread/condition_variable.hpp:16:0,
                 from /usr/include/boost/thread.hpp:14,
                 from otsystem.h:34,
                 from luascript.h:20,
                 from configmanager.h:20,
                 from otpch.h:40,
                 from allocator.cpp:17:
/usr/include/boost/thread/pthread/condition_variable.hpp: In member function âvoid boost::condition_variable::wait(boost::unique_lock<boost::mutex>&)â:
/usr/include/boost/thread/pthread/condition_variable.hpp:51:62: error: âinternal_mutexâ was not declared in this scope
/usr/include/boost/thread/pthread/condition_variable.hpp: In member function âbool boost::condition_variable::timed_wait(boost::unique_lock<boost::mutex>&, const system_time&)â:
/usr/include/boost/thread/pthread/condition_variable.hpp:61:62: error: âinternal_mutexâ was not declared in this scope
/usr/include/boost/thread/pthread/condition_variable.hpp: In member function âvoid boost::condition_variable::notify_one()â:
/usr/include/boost/thread/pthread/condition_variable.hpp:76:66: error: âinternal_mutexâ was not declared in this scope
/usr/include/boost/thread/pthread/condition_variable.hpp: In member function âvoid boost::condition_variable::notify_all()â:
/usr/include/boost/thread/pthread/condition_variable.hpp:82:66: error: âinternal_mutexâ was not declared in this scope
In file included from /usr/include/boost/thread/condition_variable.hpp:16:0,
                 from /usr/include/boost/thread.hpp:14,
                 from otsystem.h:34,
                 from luascript.h:20,
                 from configmanager.h:20,
                 from otpch.h:40,
                 from connection.cpp:18:
/usr/include/boost/thread/pthread/condition_variable.hpp: In member function âvoid boost::condition_variable::wait(boost::unique_lock<boost::mutex>&)â:
/usr/include/boost/thread/pthread/condition_variable.hpp:51:62: error: âinternal_mutexâ was not declared in this scope
/usr/include/boost/thread/pthread/condition_variable.hpp: In member function âbool boost::condition_variable::timed_wait(boost::unique_lock<boost::mutex>&, const system_time&)â:
/usr/include/boost/thread/pthread/condition_variable.hpp:61:62: error: âinternal_mutexâ was not declared in this scope
/usr/include/boost/thread/pthread/condition_variable.hpp: In member function âvoid boost::condition_variable::notify_one()â:
/usr/include/boost/thread/pthread/condition_variable.hpp:76:66: error: âinternal_mutexâ was not declared in this scope
/usr/include/boost/thread/pthread/condition_variable.hpp: In member function âvoid boost::condition_variable::notify_all()â:
/usr/include/boost/thread/pthread/condition_variable.hpp:82:66: error: âinternal_mutexâ was not declared in this scope
In file included from /usr/include/boost/thread/condition_variable.hpp:16:0,
                 from /usr/include/boost/thread.hpp:14,
                 from otsystem.h:34,
                 from luascript.h:20,
                 from configmanager.h:20,
                 from otpch.h:40,
                 from condition.cpp:17:
/usr/include/boost/thread/pthread/condition_variable.hpp: In member function âvoid boost::condition_variable::wait(boost::unique_lock<boost::mutex>&)â:
/usr/include/boost/thread/pthread/condition_variable.hpp:51:62: error: âinternal_mutexâ was not declared in this scope
/usr/include/boost/thread/pthread/condition_variable.hpp: In member function âbool boost::condition_variable::timed_wait(boost::unique_lock<boost::mutex>&, const system_time&)â:
/usr/include/boost/thread/pthread/condition_variable.hpp:61:62: error: âinternal_mutexâ was not declared in this scope
/usr/include/boost/thread/pthread/condition_variable.hpp: In member function âvoid boost::condition_variable::notify_one()â:
/usr/include/boost/thread/pthread/condition_variable.hpp:76:66: error: âinternal_mutexâ was not declared in this scope
/usr/include/boost/thread/pthread/condition_variable.hpp: In member function âvoid boost::condition_variable::notify_all()â:
/usr/include/boost/thread/pthread/condition_variable.hpp:82:66: error: âinternal_mutexâ was not declared in this scope
In file included from /usr/include/boost/thread/condition_variable.hpp:16:0,
                 from /usr/include/boost/thread.hpp:14,
                 from otsystem.h:34,
                 from luascript.h:20,
                 from configmanager.h:20,
                 from otpch.h:40,
                 from baseevents.cpp:17:
/usr/include/boost/thread/pthread/condition_variable.hpp: In member function âvoid boost::condition_variable::wait(boost::unique_lock<boost::mutex>&)â:
/usr/include/boost/thread/pthread/condition_variable.hpp:51:62: error: âinternal_mutexâ was not declared in this scope
/usr/include/boost/thread/pthread/condition_variable.hpp: In member function âbool boost::condition_variable::timed_wait(boost::unique_lock<boost::mutex>&, const system_time&)â:
/usr/include/boost/thread/pthread/condition_variable.hpp:61:62: error: âinternal_mutexâ was not declared in this scope
/usr/include/boost/thread/pthread/condition_variable.hpp: In member function âvoid boost::condition_variable::notify_one()â:
/usr/include/boost/thread/pthread/condition_variable.hpp:76:66: error: âinternal_mutexâ was not declared in this scope
/usr/include/boost/thread/pthread/condition_variable.hpp: In member function âvoid boost::condition_variable::notify_all()â:
/usr/include/boost/thread/pthread/condition_variable.hpp:82:66: error: âinternal_mutexâ was not declared in this scope
In file included from /usr/include/boost/thread/condition_variable.hpp:16:0,
                 from /usr/include/boost/thread.hpp:14,
                 from otsystem.h:34,
                 from luascript.h:20,
                 from configmanager.h:20,
                 from otpch.h:40,
                 from combat.cpp:17:
/usr/include/boost/thread/pthread/condition_variable.hpp: In member function âvoid boost::condition_variable::wait(boost::unique_lock<boost::mutex>&)â:
/usr/include/boost/thread/pthread/condition_variable.hpp:51:62: error: âinternal_mutexâ was not declared in this scope
/usr/include/boost/thread/pthread/condition_variable.hpp: In member function âbool boost::condition_variable::timed_wait(boost::unique_lock<boost::mutex>&, const system_time&)â:
/usr/include/boost/thread/pthread/condition_variable.hpp:61:62: error: âinternal_mutexâ was not declared in this scope
/usr/include/boost/thread/pthread/condition_variable.hpp: In member function âvoid boost::condition_variable::notify_one()â:
/usr/include/boost/thread/pthread/condition_variable.hpp:76:66: error: âinternal_mutexâ was not declared in this scope
/usr/include/boost/thread/pthread/condition_variable.hpp: In member function âvoid boost::condition_variable::notify_all()â:
/usr/include/boost/thread/pthread/condition_variable.hpp:82:66: error: âinternal_mutexâ was not declared in this scope
make[1]: *** [allocator.o] Error 1
make[1]: *** Waiting for unfinished jobs....
make[1]: *** [baseevents.o] Error 1
In file included from /usr/include/boost/thread/condition_variable.hpp:16:0,
                 from /usr/include/boost/thread.hpp:14,
                 from otsystem.h:34,
                 from luascript.h:20,
                 from configmanager.h:20,
                 from otpch.h:40,
                 from chat.cpp:17:
/usr/include/boost/thread/pthread/condition_variable.hpp: In member function âvoid boost::condition_variable::wait(boost::unique_lock<boost::mutex>&)â:
/usr/include/boost/thread/pthread/condition_variable.hpp:51:62: error: âinternal_mutexâ was not declared in this scope
/usr/include/boost/thread/pthread/condition_variable.hpp: In member function âbool boost::condition_variable::timed_wait(boost::unique_lock<boost::mutex>&, const system_time&)â:
/usr/include/boost/thread/pthread/condition_variable.hpp:61:62: error: âinternal_mutexâ was not declared in this scope
/usr/include/boost/thread/pthread/condition_variable.hpp: In member function âvoid boost::condition_variable::notify_one()â:
/usr/include/boost/thread/pthread/condition_variable.hpp:76:66: error: âinternal_mutexâ was not declared in this scope
/usr/include/boost/thread/pthread/condition_variable.hpp: In member function âvoid boost::condition_variable::notify_all()â:
/usr/include/boost/thread/pthread/condition_variable.hpp:82:66: error: âinternal_mutexâ was not declared in this scope
In file included from /usr/include/boost/thread/condition_variable.hpp:16:0,
                 from /usr/include/boost/thread.hpp:14,
                 from otsystem.h:34,
                 from luascript.h:20,
                 from configmanager.h:20,
                 from otpch.h:40,
                 from configmanager.cpp:17:
/usr/include/boost/thread/pthread/condition_variable.hpp: In member function âvoid boost::condition_variable::wait(boost::unique_lock<boost::mutex>&)â:
/usr/include/boost/thread/pthread/condition_variable.hpp:51:62: error: âinternal_mutexâ was not declared in this scope
/usr/include/boost/thread/pthread/condition_variable.hpp: In member function âbool boost::condition_variable::timed_wait(boost::unique_lock<boost::mutex>&, const system_time&)â:
/usr/include/boost/thread/pthread/condition_variable.hpp:61:62: error: âinternal_mutexâ was not declared in this scope
/usr/include/boost/thread/pthread/condition_variable.hpp: In member function âvoid boost::condition_variable::notify_one()â:
/usr/include/boost/thread/pthread/condition_variable.hpp:76:66: error: âinternal_mutexâ was not declared in this scope
/usr/include/boost/thread/pthread/condition_variable.hpp: In member function âvoid boost::condition_variable::notify_all()â:
/usr/include/boost/thread/pthread/condition_variable.hpp:82:66: error: âinternal_mutexâ was not declared in this scope
make[1]: *** [connection.o] Error 1
make[1]: *** [condition.o] Error 1
make[1]: *** [beds.o] Error 1
make[1]: *** [actions.o] Error 1
make[1]: *** [combat.o] Error 1
make[1]: *** [chat.o] Error 1
make[1]: *** [configmanager.o] Error 1
make[1]: Leaving directory `/otserv3/trunk'
make: *** [all] Error 2
 

 

eu utilizei a source do Luuck que postou aqui no tibia King, relacionado a players de spoffing e deu esse erro ai, podem me ajudar?

Editado por sear10 (veja o histórico de edições)

 

6cb96129-c6fb-49ca-8267-4cbf4f41578c.gif

Link para o post
Compartilhar em outros sites

Cara, aparentemente o erro está relacionado a libboost, como um amigo meu diz, aparentemente ela é desenvolvida por macacos. O que eu recomendo, é você tentar outra source, ou reinstalar a libboost.

-"Supra Omnes Lux Lucis"

- Acima de todos brilha a Luz -

5VGnDyBz.png

Link para o post
Compartilhar em outros sites

Participe da conversa

Você pode postar agora e se cadastrar mais tarde. Se você tem uma conta, faça o login para postar com sua conta.

Visitante
Responder

×   Você colou conteúdo com formatação.   Remover formatação

  Apenas 75 emojis são permitidos.

×   Seu link foi automaticamente incorporado.   Mostrar como link

×   Seu conteúdo anterior foi restaurado.   Limpar o editor

×   Não é possível colar imagens diretamente. Carregar ou inserir imagens do URL.

  • Quem Está Navegando   0 membros estão online

    Nenhum usuário registrado visualizando esta página.

×
×
  • Criar Novo...

Informação Importante

Confirmação de Termo