Jump to content
Close
Sign in to follow this  
Kolisium

[Compilar] Erro ao compilar TFS 0.4 - Ubuntu 14.04

Recommended Posts

Segue o erro:

In file included from /usr/include/boost/filesystem.hpp:15:0,
                 from luascript.cpp:21:
/usr/include/boost/filesystem/config.hpp:16:5: error: #error Compiling Filesystem version 3 file with BOOST_FILESYSTEM_VERSION defined != 3
#   error Compiling Filesystem version 3 file with BOOST_FILESYSTEM_VERSION defined != 3
     ^
make[1]: ** [luascript.o] Erro 1
make[1]: Saindo do diretório `/home/joao/ot'
make: ** [all] Erro 2

Share this post


Link to post
Share on other sites

1. Abra o arquivo: /usr/include/boost/filesystem/config.hpp

Na linha 16, troque != 3 para != 2

 

2. otsystem.h, antes de: (± linha 125)

#define foreach BOOST_FOREACH
#define reverse_foreach BOOST_REVERSE_FOREACH
#endif

adicione:

#if BOOST_VERSION < 104400
#define BOOST_DIR_ITER_FILENAME(iterator) (iterator)->path().filename()
#else
#define BOOST_DIR_ITER_FILENAME(iterator) (iterator)->path().filename().string()
#endif

luascript.cpp, troque: (± linha 740)

std::string s = it->leaf();

por:

std::string s = BOOST_DIR_ITER_FILENAME(it);

scriptmanager.cpp (± linha 130), faça a mesma coisa



"É muito melhor arriscar coisas grandiosas, alcançar triunfos e glórias, mesmo expondo-se a derrota, do que formar fila com os pobres de espírito que nem gozam muito nem sofrem muito, porque vivem nessa penumbra cinzenta que não conhece vitória nem derrota." Theodore Roosevelt

Share this post


Link to post
Share on other sites

Vlw chapa funcionou certinho!


Share this post


Link to post
Share on other sites

Posso resucitar este topico? 
TO COM PROBLEMAS, fiz oque disse para fazer, porem

In file included from /usr/include/boost/filesystem.hpp:15:0,
                 from luascript.cpp:21:
/usr/include/boost/filesystem/config.hpp:16:5: error: #error Compiling Filesystem version 3 file with BOOST_FILESYSTEM_VERSION defined != 2
 #   error Compiling Filesystem version 3 file with BOOST_FILESYSTEM_VERSION defined != 2
     ^
make[1]: *** [luascript.o] Error 1

oque pode ser segui os passos


Share this post


Link to post
Share on other sites
Em 21/05/2015 22:26:14, gangul321 disse:

Posso resucitar este topico? 
TO COM PROBLEMAS, fiz oque disse para fazer, porem


In file included from /usr/include/boost/filesystem.hpp:15:0,
                 from luascript.cpp:21:
/usr/include/boost/filesystem/config.hpp:16:5: error: #error Compiling Filesystem version 3 file with BOOST_FILESYSTEM_VERSION defined != 2
 #   error Compiling Filesystem version 3 file with BOOST_FILESYSTEM_VERSION defined != 2
     ^
make[1]: *** [luascript.o] Error 1

oque pode ser segui os passos

 

 

 

Eu tava com o mesmo problema, a parada é que você não mudou todas as opções do boost_filesystem pra != 2

abre o  /usr/include/boost/filesystem/config.hpp 

e troca as duas opções por != 2.

 

vai ficar assim

  1. # if defined(BOOST_FILESYSTEM_VERSION) && BOOST_FILESYSTEM_VERSION != 2
  2. #   error Compiling Filesystem version 3 file with BOOST_FILESYSTEM_VERSION defined != 2
  3. # endif

 

 

Igual o cara explicou ali só que ele falou pra mudar o de uma linha só.

 

 

 


Share this post


Link to post
Share on other sites
Em 24/04/2015 ás 17:42, Fir3element disse:

Funfo Mais Agora fui copilar apareceu isso

 

In file included from house.h:20:0,
                 from actions.cpp:36:
otsystem.h:18:0: error: unterminated #ifndef
 #ifndef __OTSYSTEM__
 



 

 

5a510dabc5375_20228663_336082076822153_8453189641140183581_n-Cpia-Cpia.jpg.ae93894455bf828fc6901b29d7395cd9.jpg

https://www.facebook.com/groups/659018184245665/

5a510e4f9a582_20228663_336082076822153_8453189641140183581_n-Cpia-Cpia.jpg.fa86c37be79982f1cc8ff619015ddd1b.jpg

https://www.facebook.com/profile.php?id=133706320308745

 

Share this post


Link to post
Share on other sites

Revivendo Tópico!

 

 

 


In file included from house.h:20:0,
                 from actions.cpp:36:
otsystem.h:18:0: error: unterminated #ifndef
 #ifndef __OTSYSTEM__
 ^
Makefile:540: recipe for target 'actions.o' failed
make[1]: *** [actions.o] Error 1

 

Alguém pra nos Ajudar?



"Ainda que eu ande pelo vale da sombra da morte, não temerei mal algum, pois tu estás comigo. Salmos 23:4"

 

 

 

Servidores? Eu indico:

logo2.png

Use o cupom TIBIAKING e receba 50% de desconto na primeira mensalidade!

Pague menos de R$ 19,00 no primeiro mês!

 

 

gqqo5n.jpg

 

Share this post


Link to post
Share on other sites

Join the conversation

You can post now and register later. If you have an account, sign in now to post with your account.

Guest
Reply to this topic...

×   Pasted as rich text.   Paste as plain text instead

  Only 75 emoji are allowed.

×   Your link has been automatically embedded.   Display as a link instead

×   Your previous content has been restored.   Clear editor

×   You cannot paste images directly. Upload or insert images from URL.

Sign in to follow this  

Open Tibia Server

Quer aprender a criar seu próprio servidor de Tibia? Então está no lugar certo, aqui você encontrará milhares de tutorias, scripts, códigos, mapas e utilitários para que você possa fazer o seu próprio servidor de Tibia partindo do zero.

Redes Sociais

Anuncie no Tibia King

Precisa de mais visibilidade em seus projetos? Quer publicidade para o seu servidor? Anuncie no Tibia King e faça sua divulgação, possuímos centenas de acessos simultâneos e milhares diários, com certeza será a sua solução! A publicação do seu anuncio é instantânea!

×
×
  • Create New...